{"text_format":"3","workbook":"xlsx","n_sheets":36,"sheets":["Cover","Version","Validation","Content","Cluster","Competition","Continent","Country","Discipline","Discipline Function","Discipline Gender","Event","Event Units","Event Unit Type","Function","Function Type","Gender","Language","Location","Marital Status","Medal Type","Organisation","Participant Status","Person Gender","Phase","Phase Type","Position","Result Status","Schedule Status","SessionType","Snow Conditions","Source","UnitMedalType","Venue","Weather Condition","Wind Direction"],"not_rendered":{"images":2,"macros":1,"defined_names":16},"read":"whole","date_system":"1900"}

{"sheet":"Cover","index":0,"n_rows":24,"n_cols":6,"rows_kept":24,"merged":[[7,1,7,8],[23,2,23,7]]}
{"$rows_empty":7}
[null,"Lillehammer 2016 \nODF Winter Youth Olympic \nCommon Codes"]
[]
[]
[{"$nulls":5},"ODF/WYOG-2016-CCD-v2.2 APP"]
[]
[]
[]
[]
[]
{"$rows_left_out":9}
{"sheet":"Version","index":1,"n_rows":39,"n_cols":5,"rows_kept":39}
["Version","Release","Date","Author","Description of Update"]
[0.1,"Draft","2015-02-27","TWODAV","Initial version based on WOLG2014, WUNI2015: NOC, sport disciplines, RSC codes, Venues, Competition Status, Location, Functions"]
[0.2,"Draft","2015-04-13","TWODAV","updated for events on all sports based on sports program description v1\nadded schedule information based on Schedule document v 1.3"]
[0.3,"Draft","2015-04-17","TWODAV","changed medal flag for Luge Doubles event\nrenamed Biathlon Single Mixed Relay Event"]
[0.4,"Draft","2015-05-13","TWODAV","added Event and Language time"]
[0.5,"Draft","2015-05-26","TWODAV","updated event and event unit tabs with new RSC code format\n3 characters for discipline,8 for event (10 for modifiers), 4 for phase and 8 for unit and subunit\nCU - changed name of Mixed Doubles so the NOC is not included\nCU - changed Semi-finals and Quarter-finals to include hyphen\nCU - updated sessions\nCU - updated schedule information"]
[0.6,"Draft","2015-05-28","TWODAV","FSK - TEAM changed QUAL phase to FNL-, adjusted the subunits for each section and added the 0001 unit\nCUR - changed subunits for all units\nALS - corrected discipline code\nALS - adjusted competition format for Parallel team event\nFRS - removed Semi and Quarter finals for HP and SS as per YORIS document\nFRS - adjusted format for Cross competition\nSBD - removed Semi and Quarter finals for HP and SS as per YORIS document\nSBD - adjusted format for Cross competition\nNCB / SJP - adjusted subunits to show SJ or CC in first two characters and the round in the second two\nCCS - adjusted format of Men's and Ladies' Cross-Country Cross competition"]
[0.7,"Draft","2015-05-29","TWODAV","removed extra 0s in event tab\nALS - changed parallel team event code to PLTEAM2-, adjusted units to include subunits\nBOB - adjusted units to include subunits\nLUG - changed Relay code to RELAY4--, adjusted units to include subunits\nIHO - changed units for Skills to include skill code\nNCB - changed team event code to NH3x3.3k, changed training to include subunits\nSJP - changed team event code to NHTeam3-, changed training to include subunits\nSKN - adjusted units to include subunits\nSSK - adjusted units to include subunits\nSTK - changed relay event code to 3000mRy4"]
[0.8,"Draft","2015-07-09","TWODAV","STK - adjusted codes and event unit names to match YORIS release - 4x QF, 4x SF, 4x Final\ncorrections to columns in Sport disciplines, Organization and Venue tabs\nadded Gender column to accommodate 0 in old RSC codes\nFSK - Correction to the event unit names for Mixed team event\nadded competition status codes for Unscheduled and Getting Ready\nadded O Open Gender\nadded head to head information for AS parallel event and Curling games\nadjusted evnt unit info names for BOB, LUG, SKN\nadded Location information\nadded tabs for Event Unit Type, Discipline Function, Position, Snow Condition, Weather Condition, Wind Direction"]
[0.9,"Draft","2015-08-04","TWODAV","changed Competition name following feedback from OC\nadded Tabs for: Content; Cluster; Continent; Country; Discipline Gender; Marital Status; Medal Type; Participant Status; Person Gender; Phase; Phase Type; Result Status; SessionType; Source; Unit Medal Type \nadjusted NOC names in organisation tab to match IOC NOC names list\nFSK - changed Team Event name to include NOC, adjusted Ladies event, team unit code\nCUR - corrected codes and event unit names, added missing H2H flags\nadded columns for disciplines to the function tab\nupdated venue names and codes, new codes added for FS (training), CU, AS, FR, SB\ncorrection to a number of copy paste/auto-fill errors in event and evnet unit tabs\nrenamed the Gender column for new version of RSC codes to G\nupdated event names for ALS, BTH, CUR, IHO, LUG, NCB, SJP, SKN, SSK\nchanged discipline for Ski-Snowboard Cross Event to SBD (no longer FRS)\nadded LYOGOC functions\nremoved venue information from Discipline tab\nadded IFs to Organisation Tab"]
{"$rows_left_out":30}
{"sheet":"Validation","index":2,"n_rows":2,"n_cols":1,"rows_kept":2,"hidden":true}
[{"$f":"CONCATENATE(\"v\",TEXT(VersionReleaseControl,GetVersionFormat()),\" \",VLOOKUP(VersionReleaseControl,Version!A21:D27,2,FALSE),\" \",TEXT(VLOOKUP(VersionReleaseControl,Version!A21:C27,3,TRUE),GetDateFormat()))","v":"v2,2 Released 11.02.2016"}]
[{"$f":"TEXT(VLOOKUP(VersionReleaseControl,Version!A2:C4,3,TRUE),GetDateFormat())","v":"17.04.2015"}]

{"sheet":"Content","index":3,"n_rows":34,"n_cols":3,"rows_kept":34}
["Codeset Name","Go To Tab","ODF Reference"]
["Cluster","Cluster"]
["Competition","Competition","CC @Competition"]
["Continent","Continent","CC @Continent"]
["Country","Country","CC @Country"]
["Discipline","Discipline","CC @Discipline"]
["Discipline Function","Discipline Function","CC @ResultsFunction"]
["Discipline Gender","Discipline Gender","CC @DiscplineGender"]
["Event","Event","CC @Event"]
["Event Unit","Event Unit","CC @Unit"]
{"$rows_left_out":25}
{"sheet":"Cluster","index":4,"n_rows":6,"n_cols":2,"rows_kept":6}
["Cluster Code","ENG Description"]
["GJO","Gjovik"]
["HAF","Hafjell"]
["HAM","Hamar"]
["HUN","Hunderfossen"]
["LIL","Lillehammer"]

{"sheet":"Competition","index":5,"n_rows":2,"n_cols":2,"rows_kept":2}
["Competition Code","Competition Name"]
["WYOG2016","Lillehammer 2016 Winter Youth Olympic Games"]

{"sheet":"Continent","index":6,"n_rows":6,"n_cols":2,"rows_kept":6}
["Continent Code","ENG Description"]
["AFR","Africa"]
["AME","Americas"]
["ASI","Asia"]
["EUR","Europe"]
["OCE","Oceania"]

{"sheet":"Country","index":7,"n_rows":224,"n_cols":8,"rows_kept":224}
["Code","Historical","Short Name (max 15) English","Long Name (max 30) English","Full Name English","Short Name (max 15) French","Long Name (max 30) French","Full Name French"]
["AFG","C","Afghanistan","Afghanistan","Afghanistan","Afghanistan","Afghanistan","Afghanistan"]
["AHO","C","Neth. Antilles","Netherlands Antilles"]
["ALB","C","Albania","Albania","Albania","Albanie","Albanie","Albanie"]
["ALG","C","Algeria","Algeria","Algeria","Algérie","Algérie","Algérie"]
["AND","C","Andorra","Andorra","Andorra","Andorre","Andorre","Andorre"]
["ANG","C","Angola","Angola","Angola","Angola","Angola","Angola"]
["ANT","C","Antigua&Barbuda","Antigua and Barbuda","Antigua and Barbuda","Antigua&Barbuda","Antigua-et-Barbuda","Antigua-et-Barbuda"]
["ANU","C","Anguilla"]
["ARG","C","Argentina","Argentina","Argentina","Argentine","Argentine","Argentine"]
{"$rows_left_out":215}
{"sheet":"Discipline","index":8,"n_rows":16,"n_cols":4,"rows_kept":16}
["Discipline Identifier","New Discipline ID","Description"]
["AS","ALP","Alpine Skiing"]
["BS","BOB","Bobsleigh"," "]
["BT","BTH","Biathlon"]
["CC","CCS","Cross-Country Skiing"]
["CU","CUR","Curling"]
["FR","FRS","Freestyle Skiing"]
["FS","FSK","Figure Skating"]
["IH ","IHO","Ice Hockey"]
["LG","LUG","Luge"]
{"$rows_left_out":7}
{"sheet":"Discipline Function","index":9,"n_rows":59,"n_cols":4,"rows_kept":59}
["Discipline Function ID","Discipline","Function","Description"]
[{"$f":"CONCATENATE(B2,C2)","v":"ALPAA01"},"ALP","AA01","Athlete"]
["ALPHED_COA","ALP","HED_COA","Head Coach"]
["ALPTCH_OFF","ALP","TCH_OFF","Technical Official"]
["BOBAA01","BOB","AA01","Athlete"]
["BTHAA01","BTH","AA01","Athlete"]
["BTHIBU_ED","BTH","IBU_ED","IBU Event Delegate"]
["BTHIBU_TDL","BTH","IBU_TDL","IBU Technical Delegate - Chairman"]
["BTHMMB","BTH","MMB","Member"]
["BTHCMP_CHF","BTH","CMP_CHF","Competition Chief"]
{"$rows_left_out":50}
{"sheet":"Discipline Gender","index":10,"n_rows":54,"n_cols":4,"rows_kept":54}
["Code","New Code","Gender","ENG Description"]
["AS","ALP",0,"Global"]
["AS","ALP","M","Men"]
["AS","ALP","W","Women"]
["AS","ALP","X","Mixed"]
["BS","BOB",0,"Global"]
["BS","BOB","M","Men"]
["BS","BOB","W","Women"]
["BS","BOB","X","Mixed"]
["BT","BTH",0,"Global"]
{"$rows_left_out":45}
{"sheet":"Event","index":11,"n_rows":121,"n_cols":15,"rows_kept":121}
["Long RSC Code","RSC Code","Discipline","DDD","Gender","G","Event","EEEEEEEE","Classification","Age Group","Event Modifier","Phase","PPPP","Name","InfoName"]
[{"$f":"CONCATENATE(D2,F2,H2,I2,J2,K2,\"------------\")","v":"ALP---------2016------------------"},{"$f":"CONCATENATE(C2,E2,G2,L2,\"00\")","v":"AS0000000"},"AS","ALP","0","-","000","--------","2016-","---","--","0","----","Alpine Skiing","Alpine Skiing"]
[{"$f":"CONCATENATE(D3,F3,H3,I3,J3,K3,\"------------\")","v":"ALPM--------2016------------------"},{"$f":"CONCATENATE(C3,E3,G3,L3,\"00\")","v":"ASM000000"},"AS","ALP","M","M","000","--------","2016-","---","--","0","----","Men's Alpine Skiing","Men's Alpine Skiing"]
["ALPMSL------20160146--------------","ASM020000","AS","ALP","M","M","020","SL------","20160","146","--","0","----","Men's Slalom","Men's Slalom"]
["ALPMGS------20160145--------------","ASM030000","AS","ALP","M","M","030","GS------","20160","145","--","0","----","Men's Giant Slalom","Men's Giant Slalom"]
["ALPMSG------20160142--------------","ASM040000","AS","ALP","M","M","040","SG------","20160","142","--","0","----","Men's Super-G","Men's Super-G"]
["ALPMAC------20160143--------------","ASM105000","AS","ALP","M","M","105","AC------","20160","143","--","0","----","Men's Alpine Combined","Men's Alpine Combined"]
["ALPW--------2016------------------","ASW000000","AS","ALP","W","W","000","--------","2016-","---","--","0","----","Ladies' Alpine Skiing","Ladies' Alpine Skiing"]
["ALPWSL------20165128--------------","ASW020000","AS","ALP","W","W","020","SL------","20165","128","--","0","----","Ladies' Slalom","Ladies' Slalom"]
["ALPWGS------20165127--------------","ASW030000","AS","ALP","W","W","030","GS------","20165","127","--","0","----","Ladies' Giant Slalom","Ladies' Giant Slalom"]
{"$rows_left_out":112}
{"sheet":"Event Units","index":12,"n_rows":1496,"n_cols":49,"rows_kept":1496}
["Long RSC Code","RSC Code","Discipline","DDD","Gender","G","Event","EEEEEEEE","Classification","Age Group","Event Modifier","Phase","PPPP","Unit","UUUU","Subunit","SS","Medal Unit","Bronze","Name","InfoName","PhaseUnit","Venue","Court","H2H","TeamEvent","Match Nr","Home","Away","Start Date","Start Time","Finish Date","Finish Time","Start Time Type","Order","Info Pages","Hide","Subunit from","Round","RoundMatch","Session","StatusCode","Info","LocationName","EventUnitType","QualiRule","ENG Unit Description","Comment"]
[{"$f":"CONCATENATE(D2,F2,H2,I2,J2,K2,M2,O2,P2,Q2)","v":"ALP---------2016------------------"},{"$f":"CONCATENATE(C2,E2,G2,L2,N2)","v":"AS0000000"},"AS","ALP","0","-","000","--------","2016-","---","--","0","----","00","----","--","--","0","0","Alpine Skiing","Alpine Skiing","Alpine Skiing",{"$nulls":24},"Alpine Skiing"]
[{"$f":"CONCATENATE(D3,F3,H3,I3,J3,K3,M3,O3,P3,Q3)","v":"ALPM--------2016------------------"},{"$f":"CONCATENATE(C3,E3,G3,L3,N3)","v":"ASM000000"},"AS","ALP","M","M","000","--------","2016-","---","--","0","----","00","----","--","--","0","0","Men's Skiing","Men's Skiing","Men's Skiing",{"$nulls":24},"Alpine Skiing"]
["ALPMSL------20160146--------------","ASM020000","AS","ALP","M","M","020","SL------","20160","146","--","0","----","00","----","--","--","0","0","Men's Slalom","Men's Slalom","Men's Slalom","HOS",{"$nulls":11},5,{"$nulls":11},"Slalom"]
["ALPMSL------20160146--FNL---------","ASM020100","AS","ALP","M","M","020","SL------","20160","146","--","1","FNL-","00","----","--","--","0","0","Men's Slalom","Slalom","Slalom","HOS",{"$nulls":6},"2016-02-19","10:00","2016-02-19","13:05",null,1,{"$nulls":11},"Slalom"]
["ALPMSL------20160146--FNL-000101--","ASM020101","AS","ALP","M","M","020","SL------","20160","146","--","1","FNL-","01","0001","01","--","0","0","Men's Slalom Run 1","Run 1","Slalom Run 1","HOS",{"$nulls":3},1,null,null,"2016-02-19","10:00","2016-02-19","10:50",{"$nulls":11},"ATH",null,"Slalom Run 1"]
["ALPMSL------20160146--FNL-000102--","ASM020102","AS","ALP","M","M","020","SL------","20160","146","--","1","FNL-","02","0001","02","--","1","1","Men's Slalom Run 2","Run 2","Slalom Run 2","HOS",{"$nulls":3},2,null,null,"2016-02-19","12:30","2016-02-19","13:05",{"$nulls":11},"ATH",null,"Slalom Run 2"]
["ALPMSL------20160146--VICT--------","ASM020M00","AS","ALP","M","M","020","SL------","20160","146","--","M","VICT","00","----","--","--","0","0","Men's Slalom Ceremonies","Ceremonies","Ceremonies","HOS",{"$nulls":6},"2016-02-19","13:30","2016-02-19","13:45","ES",2,{"$nulls":11},"Slalom Ceremonies"]
["ALPMSL------20160146--VICTMEDAL---","ASM020M01","AS","ALP","M","M","020","SL------","20160","146","--","M","VICT","01","MEDA","L-","--","0","0","Men's Slalom Victory Ceremony","Victory Ceremony","Victory Ceremony","HOS",{"$nulls":6},"2016-02-19","13:30","2016-02-19","13:45","ES",{"$nulls":12},"Slalom Victory Ceremony"]
["ALPMGS------20160145--------------","ASM030000","AS","ALP","M","M","030","GS------","20160","145","--","0","----","00","----","--","--","0","0","Men's Giant Slalom","Men's Giant Slalom","Men's Giant Slalom","HOS",{"$nulls":11},6,{"$nulls":11},"Giant Slalom"]
{"$rows_left_out":1487}
{"sheet":"Event Unit Type","index":13,"n_rows":10,"n_cols":2,"rows_kept":10}
["ID","ENG Description"]
["ATH","Individuals"]
["COUP","Couples"]
["HATH","Individuals Head to Head"]
["HCOUP","Couples Head to Head"]
["HNOC","NOC Head to Head"]
["HTEAM","Teams Head to Head"]
["NOC","NOC"]
["NONE","Not Applicable"]
["TEAM","Teams"]
{"$rows_left_out":1}
{"sheet":"Function","index":14,"n_rows":212,"n_cols":19,"rows_kept":212}
["Function ID","Function","Function Type","AS","BS","BT","CC","CU","FR","FS","IH ","LG","NC","SB","SJ","SN","SS","ST","used"]
["AA01","Athlete","A","x","x","x","x","x","x","x","x","x","x","x","x","x","x","x","x"]
["AA02","NOC President"]
["AA03","NOC Secretary General"]
["AA04","NOC Accompanying Guest"]
["AA05","NOC Representative"]
["AA06","Chef de Mission"]
["AA07","Team Official"]
["AA08","Young Ambassador"]
["AA08","Coach"]
{"$rows_left_out":203}
{"sheet":"Function Type","index":15,"n_rows":7,"n_cols":2,"rows_kept":7}
["Function Type ID","Function Type"]
["A","Athlete"]
["C","Coach"]
["G","Guide"]
["J","Judge"]
["S","Technical Official"]
["T","Team Official"]

{"sheet":"Gender","index":16,"n_rows":6,"n_cols":2,"rows_kept":6}
["Gender","Description"]
["M","Men"]
["W","Women"]
["X","Mixed"]
[0,"Global"]
["O","Open"]

{"sheet":"Language","index":17,"n_rows":4,"n_cols":2,"rows_kept":4}
["LanguageCode","Language"]
["ENG","English"]
["FRE","French"]
["NOR","Norwegian"]

{"sheet":"Location","index":18,"n_rows":20,"n_cols":3,"rows_kept":20}
["LocationCode","Venue","LocationName"]
["BBS","BBS","Birkebeineren Biathlon Stadium"]
["BCC","BCC","Birkebeineren Cross-Country Stadium"]
["CUA","SCH","A"]
["CUB","SCH","B"]
["CUC","SCH","C"]
["CUD","SCH","D"]
["CUE","SCH","E"]
["SCH","SCH","Lillehammer Curling Hall"]
["GOC","GOC","Gjovik Olympic Cavern Hall"]
{"$rows_left_out":11}
{"sheet":"Marital Status","index":19,"n_rows":7,"n_cols":2,"rows_kept":7}
["MaritalStatus Code","ENG Description"]
["CLF","Common Law / De Facto"]
["DIV","Divorced"]
["MAR","Married"]
["SEP","Seperated"]
["SIN","Single"]
["WID","Widowed"]

{"sheet":"Medal Type","index":20,"n_rows":4,"n_cols":2,"rows_kept":4}
["MedalType Code","Description"]
["Gold","Gold"]
["Silver","Silver"]
["Bronze","Bronze"]

{"sheet":"Organisation","index":21,"n_rows":223,"n_cols":10,"rows_kept":223}
["Code","Historical","Short Name (max 15) English","Long Name (max 30) English","Full Name English","Short Name (max 15) French","Long Name (max 30) French","Full Name French","Continent","OMDOrder"]
["AFG","C","Afghanistan","Afghanistan","Afghanistan","Afghanistan","Afghanistan","Afghanistan",null,"1"]
["ALB","C","Albania","Albania","Albania","Albanie","Albanie","Albanie",null,"3"]
["ALG","C","Algeria","Algeria","Algeria","Algérie","Algérie","Algérie",null,"4"]
["AND","C","Andorra","Andorra","Andorra","Andorre","Andorre","Andorre",null,"6"]
["ANG","C","Angola","Angola","Angola","Angola","Angola","Angola",null,"7"]
["ANT","C","Antigua&Barbuda","Antigua and Barbuda","Antigua and Barbuda","Antigua&Barbuda","Antigua-et-Barbuda","Antigua-et-Barbuda",null,"8"]
["ARG","C","Argentina","Argentina","Argentina","Argentine","Argentine","Argentine",null,"10"]
["ARM","C","Armenia","Armenia","Armenia","Arménie","Arménie","Arménie",null,"11"]
["ARU","C","Aruba","Aruba","Aruba","Aruba","Aruba","Aruba",null,"12"]
{"$rows_left_out":214}
{"sheet":"Participant Status","index":22,"n_rows":3,"n_cols":2,"rows_kept":3}
["ParticipantStatus Code","Description"]
["ACTIVE","Active"]
["CANCEL","Cancelled"]

{"sheet":"Person Gender","index":23,"n_rows":3,"n_cols":2,"rows_kept":3}
["PersonGender Code","ENG Description"]
["M","Male"]
["W","Female"]

{"sheet":"Phase","index":24,"n_rows":350,"n_cols":21,"rows_kept":350}
["Long RSC Code","RSC Code","Discipline","DDD","Gender","G","Event","EEEEEEEE","Classification","Age Group","Event Modifier","Phase","PPPP","Unit","UUUU","Subunit","SS","Medal Unit","Bronze","Name","InfoName"]
[{"$f":"CONCATENATE(D2,F2,H2,I2,J2,K2,M2,O2,P2,Q2)","v":"ALP---------2016------------------"},{"$f":"CONCATENATE(C2,E2,G2,L2,N2)","v":"AS0000000"},"AS","ALP","0","-","000","--------","2016-","---","--","0","----","00","----","--","--","0","0","Alpine Skiing","Alpine Skiing"]
[{"$f":"CONCATENATE(D3,F3,H3,I3,J3,K3,M3,O3,P3,Q3)","v":"ALPM--------2016------------------"},{"$f":"CONCATENATE(C3,E3,G3,L3,N3)","v":"ASM000000"},"AS","ALP","M","M","000","--------","2016-","---","--","0","----","00","----","--","--","0","0","Men's Skiing","Men's Skiing"]
["ALPMSL------20160146--------------","ASM020000","AS","ALP","M","M","020","SL------","20160","146","--","0","----","00","----","--","--","0","0","Men's Slalom","Men's Slalom"]
["ALPMSL------20160146--FNL---------","ASM020100","AS","ALP","M","M","020","SL------","20160","146","--","1","FNL-","00","----","--","--","0","0","Men's Slalom","Slalom"]
["ALPMSL------20160146--VICT--------","ASM020M00","AS","ALP","M","M","020","SL------","20160","146","--","M","VICT","00","----","--","--","0","0","Men's Slalom Ceremonies","Ceremonies"]
["ALPMGS------20160145--------------","ASM030000","AS","ALP","M","M","030","GS------","20160","145","--","0","----","00","----","--","--","0","0","Men's Giant Slalom","Men's Giant Slalom"]
["ALPMGS------20160145--FNL---------","ASM030100","AS","ALP","M","M","030","GS------","20160","145","--","1","FNL-","00","----","--","--","0","0","Men's Giant Slalom","Slalom"]
["ALPMGS------20160145--VICT--------","ASM030M00","AS","ALP","M","M","030","GS------","20160","145","--","M","VICT","00","----","--","--","0","0","Men's Giant Slalom Ceremonies","Ceremonies"]
["ALPMSG------20160142--------------","ASM040000","AS","ALP","M","M","040","SG------","20160","142","--","0","----","00","----","--","--","0","0","Men's Super-G","Men's Super-G"]
{"$rows_left_out":341}
{"sheet":"Phase Type","index":25,"n_rows":11,"n_cols":3,"rows_kept":11}
["PhaseType Code","ENG Description","Schedule type"]
[0,"Opening/Closing Ceremonies","G"]
[1,"Official Training","G"]
[2,"Unofficial Training","N"]
[3,"Competition","G"]
[4,"Technical Meeting","N"]
[5,"Press Conference","N"]
[6,"Victory Ceremony","N"]
[7,"Draw","N"]
[8,"Others","N"]
{"$rows_left_out":2}
{"sheet":"Position","index":26,"n_rows":13,"n_cols":4,"rows_kept":13}
["ID","Discipline","Position Order","ENG Description"]
[4,"CUR",1,"Fourth"]
[3,"CUR",2,"Third"]
[2,"CUR",3,"Second"]
[1,"CUR",4,"Lead"]
["A","CUR",5,"Alternate"]
["F","CUR",1,"Female"]
["M","CUR",2,"Male"]
["GK","IHO",1,"Goalkeeper"]
["F","IHO",3,"Forward"]
{"$rows_left_out":4}
{"sheet":"Result Status","index":27,"n_rows":9,"n_cols":4,"rows_kept":9}
["Results Status Code","Order","Description","Note"]
["START_LIST",1,"Before competition, Start list"]
["LIVE",2,"For live updates during competition"]
["INTERMEDIATE",3,"When competition is stopped, used at pre-defined points"]
["UNCONFIRMED",4,"When the unit is over but not yet UNOFFICIAL or OFFICIAL"]
["UNOFFICIAL",5,"Results of the competition released as soon as the event is over, not waiting any official decision of the International Federation. The correctness of data must be assured","Only used if other statuses do not come quickly, not used in all sports"]
["OFFICIAL",6,"Results of the competition released as soon as the event is officially confirmed taking into account the resolution of the protests etc."]
["PARTIAL",7,"Incomplete list, Final Ranking. Used in PDF"]
["PROTESTED",8,"After the competition is no longer LIVE and a protest has been lodged","After all decisions on the protest are made the ResultStatus will change to UNOFFICIAL or OFFICIAL as appropriate"]

{"sheet":"Schedule Status","index":28,"n_rows":12,"n_cols":4,"rows_kept":12}
["ODF1 Code","ODF2 Code","Label","Description"]
[1,"UNSCHEDULED","Planned","Planned (planned to be held, but not sure - due to number of participants for instance)"]
[2,"SCHEDULED","Scheduled","Scheduled (scheduled, but not started)"]
[3,"GETTING_READY","Getting Ready","Getting Ready"]
[4,"RUNNING","Running","Running (in progress)"]
[15,"INTERRUPTED","Interrupted","Interrupted (competition is on hold, but will be continued - i. e. Weather, medical, preperation breaks in Alpine, Ski Jumping, Snowboard, Freestyle, aso.)"]
[null,"SCHEDULED_BREAK","Scheduled Break","Scheduled Break"]
[8,"FINISHED","Finished","Finished (for trainings, team captain meetings, incl Unofficial, Official, Protested)"]
[9,"DELAYED","Delayed","Delayed (delayed by few minutes, but not postponed)"]
[11,"CANCELLED","Cancelled","Cancelled (cancelled, will not be rescheduled)"]
{"$rows_left_out":3}
{"sheet":"SessionType","index":29,"n_rows":7,"n_cols":2,"rows_kept":7}
["SessionType","ENG Description"]
["AFT","Afternoon"]
["ALL","All Day"]
["EAF","Early Afternoon"]
["EVE","Evening"]
["LAF","Late Afternoon"]
["MOR","Morning"]

{"sheet":"Snow Conditions","index":30,"n_rows":22,"n_cols":2,"rows_kept":22}
["ID","ENG Description"]
["cmp","Compact"]
["f-g","Fine Grained"]
["grn","Granular"]
["hrd","Hard"]
["hrd-p","Hard Packed"]
["hrd-p-v","hard Packed Variable"]
["icy","Icy"]
["p","Packed"]
["ppwd","Packed Powder"]
{"$rows_left_out":13}
{"sheet":"Source","index":31,"n_rows":20,"n_cols":3,"rows_kept":20}
["SourceCode","Discipline ID","LocationName"]
["HOSALP1","ALP","Alpine Skiing"]
["HOSALP2","ALP","Alpine Skiing"]
["LOSBOB1","BOB","Bobsleigh"]
["BBSBTH1","BTH","Biathlon"]
["BCCCCS1","CCS","Cross-Country Skiing"]
["SCHCUR1","CUR","Curling"]
["OVHFRS1","FRS","Freestyle Skiing"]
["OVHFRS2","FRS","Freestyle Skiing (Halfpipe)"]
["HAMFSK1","FSK","Figure Skating"]
{"$rows_left_out":11}
{"sheet":"UnitMedalType","index":32,"n_rows":4,"n_cols":2,"rows_kept":4}
["UnitMedalType Code","Description"]
[0,"No medal event unit"]
[1,"Gold medal event unit"]
[2,"Bronze medal event unit"]

{"sheet":"Venue","index":33,"n_rows":34,"n_cols":4,"rows_kept":34}
["Venue","Discipline","Competition","ENG Description"]
["HAM","FSK","Y","Hamar Olympic Amphitheatre"]
["STO","FSK","Y","Storhamarhallen"]
["GOC","STK","Y","Gjovik Olympic Cavern Hall"]
["HOH","SSK","Y","Hamar Olympic Hall Viking Ship"]
["SKH","IHO","Y","Kristins Hall"]
["SYH","IHO","Y","Youth Hall"]
["SCH","CUR","Y","Lillehammer Curling Hall"]
["LOS","BOB, LUG, SKN","Y","Lillehammer Olympic Sliding Centre"]
["HOS","ALP","Y","Hafjell Olympic Slope"]
{"$rows_left_out":25}
{"sheet":"Weather Condition","index":34,"n_rows":20,"n_cols":2,"rows_kept":20}
["ID","ENG Description"]
["bliz","Blizzard"]
["cldy","Cloudy"]
["clr","Sky Clear"]
["fog","Fog"]
["h-rain","heavy Rain"]
["l-s","Light Snow"]
["lv","Limited Visibility"]
["mcdy","Mostly Cloudy"]
["pc","Partly Cloudy"]
{"$rows_left_out":11}
{"sheet":"Wind Direction","index":35,"n_rows":18,"n_cols":2,"rows_kept":18}
["ID","ENG Description"]
["E","East"]
["ENE","East-North-East"]
["ESE","East-South-East"]
["N","North"]
["NE","North-East"]
["NNE","North-North-East"]
["NNW","North-North-West"]
["NW","North-West"]
["S","South"]
{"$rows_left_out":8}